Noordergraf
type: Ontology
description: Ontologie voor Noordergraf
description: Ontology for Noordergraf @eng
dc modified: 2025-07-22T16:44:02Z

Age
type: Class
comment: De leeftijd van een persoon bij overlijden.
comment: The age of a person at the time of death. @eng
subclass of: Class
subclass of: WithDuration
subclass of: WithInferred
subclass of: WithText

Album
type: Class
comment: A collection of audio recordings. @eng
comment: Een geluidsdrager met muzikaal werk erop.
subclass of: Class
subclass of: WithDate

Artist
type: Class
comment: A performing musician or singer. @eng
comment: Een uitvoerend muzikant of zanger.
subclass of: Class
subclass of: WithSameAs

Aunt
type: Class
comment: An aunt. @eng
comment: Een tante.
subclass of: Relation

author
type: Class
comment: A person who writes a book. @eng
comment: De schrijver van een boek.
subclass of: Class
subclass of: WithSameAs

Battalion
type: Class
comment: A battalion. @eng
comment: Een bataljon.
subclass of: Organisation

BibleBook
type: Class
comment: Book which is part of the Bible (or is considered to be by some). @eng
comment: Een boek dat deel uitmaakt van de Bijbel (of wordt verondersteld door sommigen).
subclass of: Class
subclass of: WithDcModified
subclass of: WithSameAs

BibleReference
type: Class
comment: A reference for a bible quote. @eng
comment: Een referentie voor een bijbeltekst.
subclass of: Reference

BookReference
type: Class
comment: A book reference. @eng
comment: Een referentie naar een boek.
subclass of: Reference
subclass of: WithDate
subclass of: WithSameAs

Brother
type: Class
comment: A brother. @eng
comment: Een broer.
subclass of: Relation

Brother-in-law
type: Class
comment: A brother-in-law. @eng
comment: Een zwager.
subclass of: Relation

Building
type: Class
comment: A building. @eng
comment: Een gebouw.
subclass of: Location

Bust
type: Class
comment: A sculpture of a person's head, neck, and a variable portion of chest and shoulders. @eng
comment: Een beeldhouwwerk dat enkel het hoofd, de borst en de schouders toont.
subclass of: Figure

Child
type: Class
comment: A child (of someone). @eng
comment: Een kind (van iemand).
subclass of: Relation

City
type: Class
comment: A city. @eng
comment: Een grote stad.
subclass of: Location

Class
comment: De hoogste class voor noordergraf.
comment: The top class for noordergraf. @eng

Colony
type: Class
comment: A colony (polity). @eng
comment: Een kolonie (staatkundig).
subclass of: Location

Company
type: Class
comment: A company: entity involved in commercial, industrial, or professional activities @eng
comment: Een bedrijf: entiteit actief in commerciële, industriële of professionele doeleinden.
subclass of: Organisation

Congregation
type: Class
comment: A congregation, a group of people regularly attending a particular place of worship. @eng
comment: Een kerkgemeente, plaatselijke geloofsgemeenschap
subclass of: Organisation

Coordinates
type: Class
comment: A coordinates of a geographic location. @eng
comment: The coördinaten van een geografische locatie.
subclass of: Class
subclass of: WithGeography

Country
type: Class
comment: A country. @eng
comment: Een land.
subclass of: Location

Creator
type: Class
comment: An entity responsible for making the resource. @eng
comment: De maker van de hulpbron.
subclass of: Class
subclass of: WithLocation
subclass of: WithName

Cross
type: Class
comment: A cross. @eng
comment: Een kruis.
subclass of: Item

Date
type: Class
comment: Calendar date. @eng
comment: Datum.
subclass of: Class
subclass of: WithDate
subclass of: WithInferred

Daughter
type: Class
comment: A daughter. @eng
comment: Een dochter.
subclass of: Relation

Daughter-in-law
type: Class
comment: A daugther in law. @eng
comment: Een schoondochter.
subclass of: Relation

Decoration
type: Class
comment: An award or dictinction given in recognition of achievement. An honorary title. @eng
comment: Een eretitel.
subclass of: Property
subclass of: WithTemporal
subclass of: WithText

Descendent
type: Class
comment: A descendant. @eng
comment: Een nakomeling, afstammeling.
subclass of: Relation

Family
type: Class
comment: A family. @eng
comment: Een familie.
subclass of: Person

Father
type: Class
comment: A father (parent). @eng
comment: Een vader.
subclass of: Relation

Father-in-law
type: Class
comment: A father-in-law. @eng
comment: Een schoonvader.
subclass of: Relation

Female
type: Class
comment: A female person @eng
comment: Een vrouwelijk persoon
subclass of: Person

Figure
type: Class
comment: An image that resembles a human; may or may not actually be or represent a person. @eng
comment: De afbeelding van een mens, al dan niet een specifieke persoon.
subclass of: Class

FolkReference
type: Class
comment: A reference to a folk song. @eng
comment: Een referentie naar een volkwijsje.
subclass of: Reference
subclass of: WithSameAs
subclass of: WithSeeAlso

Foster parent
type: Class
comment: A foster parent. @eng
comment: Een pleegouder.
subclass of: Relation

Friend
type: Class
comment: A friend (of someone). @eng
comment: Een vriend (van iemand).
subclass of: Relation

geo Point
type: Class
comment: A point, typically described using a coordinate system relative to Earth, such as WGS84. @eng
comment: Een punt, meestal beschreven met behulp van een coördinatensysteem ten opzichte van de aarde, zoals WGS84.
subclass of: Class

Grandaunt
type: Class
comment: A grandaunt. @eng
comment: Een oudtante.
subclass of: Relation

Grandchild
type: Class
comment: A grandchild. @eng
comment: Een kleinkind.
subclass of: Relation

Grandfather
type: Class
comment: A grandfather. @eng
comment: Een grootvader.
subclass of: Relation

Grandmother
type: Class
comment: A grandmother. @eng
comment: Een grootmoeder.
subclass of: Relation

Grandparent
type: Class
comment: A grandparent. @eng
comment: Een grootouder.
subclass of: Relation

Granduncle
type: Class
comment: A granduncle. @eng
comment: Een oudoom.
subclass of: Relation

Great-grandfather
type: Class
comment: A great-grandvader. @eng
comment: Een overgrootvader.
subclass of: Relation

Great-grandmother
type: Class
comment: A great-grandmother. @eng
comment: Een overgrootmoeder.
subclass of: Relation

Great-grandparent
type: Class
comment: A great-grandparent. @eng
comment: Een overgrootouder.
subclass of: Relation

Hamlet
type: Class
comment: A hamlet. @eng
comment: Een gehucht.
subclass of: Location

Housemate
type: Class
comment: A housemate. @eng
comment: Een huisgenoot.
subclass of: Relation

Housewife
type: Class
comment: A houswife. @eng
comment: Een huisvrouw.
subclass of: Relation

Husband
type: Class
comment: A husband. @eng
comment: Een echtgenoot.
subclass of: Relation

HymnReference
type: Class
comment: A reference to a hymn. @eng
comment: Een referentie naar een kerklied.
subclass of: Reference

Island
type: Class
comment: A island. @eng
comment: Een eiland.
subclass of: Location

Item
type: Class
comment: A tomb, a cross, or some other monument. @eng
comment: Een graf, een kruis, of een ander soort monument.
subclass of: Class
subclass of: WithDate
subclass of: WithDcModified
subclass of: WithGeography
subclass of: WithText

Leermeester
type: Class
comment: A tutor @eng
comment: Een leermeester.
subclass of: Relation

Location
type: Class
comment: Een plek ergens op aarde.
comment: Some physical location on earth. @eng
subclass of: Class
subclass of: WithText

Male
type: Class
comment: A male person @eng
comment: Een mannelijk persoon
subclass of: Person

Mixin
type: Class
comment: A class with properties to include in other classes. @eng
comment: Een klasse met eigenschappen om toe te voegen aan andere klassen.

Mother
type: Class
comment: A mother. @eng
comment: Een moeder.
subclass of: Relation

Mother-in-law
type: Class
comment: A mother-in-law. @eng
comment: Een schoonmoeder.
subclass of: Relation

Municipality
type: Class
comment: A municipality. @eng
comment: Een gemeente (staatkundig).
subclass of: Location

MusicReference
type: Class
comment: A music reference. @eng
comment: Een muziekreferentie.
subclass of: Reference

Name
type: Class
comment: A name object of a person. @eng
comment: Het naamobject van een persoon.
subclass of: Class
subclass of: WithText

Niece
type: Class
comment: A niece. @eng
comment: Een dochter van een broer of zus.
subclass of: Relation

Occupation
type: Class
comment: An occupation. @eng
comment: Een beroep, vak.
subclass of: Class
subclass of: WithLocation
subclass of: WithTemporal
subclass of: WithText

Ocean
type: Class
comment: A ocean. @eng
comment: Een oceaan.
subclass of: Location

Organisation
type: Class
comment: An organisation, institution, school, company... @eng
comment: Een organisatie, instelling, school, bedrijf...
subclass of: Class
subclass of: WithLocation

Parent
type: Class
comment: A parent. @eng
comment: Een ouder.
subclass of: Relation

People
type: Class
comment: Meerdere personen.
comment: Multiple persons. @eng
subclass of: Person

Period
type: Class
comment: A length of time. @eng
comment: Een tijdsduur.
subclass of: Class
subclass of: WithDuration
subclass of: WithText

Person
type: Class
comment: A person mentioned on a tomb stone or other monument. @eng
comment: Iemand die genoemd wordt een grafsteen of ander monument.
subclass of: Class
subclass of: WithLocation
subclass of: WithName
subclass of: WithSameAs
subclass of: WithText

Personnel
type: Class
comment: Personeel.
comment: Personnel. @eng
subclass of: Person

Photo
type: Class
comment: A photograph. @eng
comment: Een foto.
subclass of: Class
subclass of: WithDcCreator
subclass of: WithDcDate
subclass of: WithDcLicense
subclass of: WithFile

Photograph
type: Class
comment: A portrait photograph. @eng
comment: Een portretfoto.
subclass of: Figure

Pictogram
type: Class
comment: A pictogram. @eng
comment: Een pictogram.
subclass of: Class
subclass of: WithDcCreator
subclass of: WithDcLicense
subclass of: WithDcSource
subclass of: WithDcTitle
subclass of: WithFile

Place
type: Class
comment: Any place, such as place of birth or place of death, from hospital to country. @eng
comment: Een plek, zoals geboorteplaats of plaats van overlijden, van ziekenhuis tot land.
subclass of: Class
subclass of: WithDcModified
subclass of: WithGeography
subclass of: WithSameAs

Portrait
type: Class
comment: An artistic representation of one or more persons. @eng
comment: Een voorstelling van één of meer personen.
subclass of: Figure

PostalAddress
type: Class
comment: Het postadres.
comment: The postal address. @eng
subclass of: Class

Property
type: Class
comment: A property. @eng
comment: Een eigenschap.
subclass of: Class

Province
type: Class
comment: A province. @eng
comment: Een provincie.
subclass of: Location

Quantity
type: Class
comment: A quantity. @eng
comment: Een hoeveelheid.
subclass of: Class

Quote
type: Class
comment: A quote. @eng
comment: Een graftekst.
subclass of: Class
subclass of: WithText

Reference
type: Class
comment: A reference. @eng
comment: Een referentie, bronvermelding.
subclass of: Class

Region
type: Class
comment: A region (geography). @eng
comment: Een regio (geografie).
subclass of: Location

Relation
type: Class
comment: A relation between people. @eng
comment: Een raltie tussen mensen.
subclass of: Class
subclass of: WithInferred
subclass of: WithTemporal
subclass of: WithText

School
type: Class
comment: A school, institution for the education of students by teachers. @eng
comment: Een school, onderwijsinstelling.
subclass of: Organisation

Schoolmakker
type: Class
comment: A schoolmate. @eng
comment: Een schoolvriend.
subclass of: Relation

SingerSongwriter
type: Class
comment: A singer performing his or her own songs. @eng
comment: Een zanger die zijn of haar eigen liederen zingt.
subclass of: Artist

Sister
type: Class
comment: A sister. @eng
comment: Een zus.
subclass of: Relation

Sister-in-law
type: Class
comment: A sister-in-law. @eng
comment: Een schoonzus.
subclass of: Relation

Site
type: Class
comment: De plek van een graf, gewoonlijk een kerkhof of begraafplaats.
comment: The site of a tomb, usually a cemetary. @eng
subclass of: Class
subclass of: WithDcModified
subclass of: WithGeography
subclass of: WithSameAs
subclass of: WithSeeAlso

Son
type: Class
comment: A son. @eng
comment: Een zoon.
subclass of: Relation

Sports Federation
type: Class
comment: A sports governing body. @eng
comment: Een sportbond.
subclass of: Organisation

Spouse
type: Class
comment: A spouse. @eng
comment: Een echtgenoot of echtgenote.
subclass of: Relation

State
type: Class
comment: A state (polity). @eng
comment: Een staat (politiek).
subclass of: Organisation

Statue
type: Class
comment: Een vrijstaand sculptuur, die een persoon of dier voorstelt.
comment: Sculpture primarily conceived as a representational figure. @eng
subclass of: Figure

Symbol
type: Class
comment: A symbol. @eng
comment: Een symbool.
subclass of: Class

SymbolType
type: Class
comment: A symbol type. @eng
comment: Een sybooltype.
subclass of: Class
subclass of: WithDcModified
subclass of: WithSameAs
subclass of: WithSeeAlso

Todo
type: Class
comment: A TO DO. @eng
comment: Een TE DOEN.
subclass of: Class

Tomb
type: Class
comment: A tomb. @eng
comment: Een graf of grafsteen.
subclass of: Item

Town
type: Class
comment: A town. @eng
comment: Een stadje.
subclass of: Location

Traveling Carnival
type: Class
comment: A traveling carnival. @eng
comment: Een kermis.
subclass of: Organisation

Twin
type: Class
comment: A twin. @eng
comment: Een tweeling.
subclass of: Relation

US State
type: Class
comment: A state of the USA. @eng
comment: Een staat van de VS.
subclass of: Location

Uncle
type: Class
comment: An uncle. @eng
comment: Een oom.
subclass of: Relation

University
type: Class
comment: A university (academic institution). @eng
comment: Een universiteit (onderwijsinstelling).
subclass of: Organisation

Verloofde
type: Class
comment: A fiancé(e). @eng
comment: Een verloofde.
subclass of: Relation

Village
type: Class
comment: A village. @eng
comment: Een dorp.
subclass of: Location

Widow
type: Class
comment: A widow. @eng
comment: Een weduwe.
subclass of: Relation

Widower
type: Class
comment: A widower. @eng
comment: Een weduwnaar.
subclass of: Relation

Wife
type: Class
comment: A wife. @eng
comment: Een echtgenote.
subclass of: Relation

WithDate
type: Class
comment: A mixin to add the 'date' property to another class. @eng
comment: Een mixin om de eigenschap 'date' toe te voegen aan een andere klasse.
subclass of: Mixin

WithDcCreator
type: Class
comment: A mixin to add the 'dcCreator' property to another class. @eng
comment: Een mixin om de eigenschap 'dcCreator' toe te voegen aan een andere klasse.
subclass of: Mixin

WithDcDate
type: Class
comment: A mixin to add the 'dcDate' property to another class. @eng
comment: Een mixin om de eigenschap 'dcDate' toe te voegen aan een andere klasse.
subclass of: Mixin

WithDcLicense
type: Class
comment: A mixin to add the 'dcLicense' property to another class. @eng
comment: Een mixin om de eigenschap 'dcLicense' toe te voegen aan een andere klasse.
subclass of: Mixin

WithDcModified
type: Class
comment: A mixin to add the 'dcModified' property to another class. @eng
comment: Een mixin om de eigenschap 'dcModified' toe te voegen aan een andere klasse.
subclass of: Mixin

WithDcSource
type: Class
comment: A mixin to add the 'dcSource' property to another class. @eng
comment: Een mixin om de eigenschap 'dcSource' toe te voegen aan een andere klasse.
subclass of: Mixin

WithDcTitle
type: Class
comment: A mixin to add the 'dcTitle' property to another class. @eng
comment: Een mixin om de eigenschap 'dcTitle' toe te voegen aan een andere klasse.
subclass of: Mixin

WithDuration
type: Class
comment: A mixin to add the 'duration' property to another class. @eng
comment: Een mixin om de eigenschap 'duration' toe te voegen aan een andere klasse.
subclass of: Mixin

WithFile
type: Class
comment: A mixin to add the 'file' property to another class. @eng
comment: Een mixin om de eigenschap 'file' toe te voegen aan een andere klasse.
subclass of: Mixin

WithGeography
type: Class
comment: A mixin to add properties related to geographical coordinates to another class. @eng
comment: Een mixin om eigenschappen gerelateerd aan geografische coördinaten toe te voegen aan een andere klasse.
subclass of: Mixin

WithInferred
type: Class
comment: A mixin to add the 'inferred' property to another class. @eng
comment: Een mixin om de eigenschap 'inferred' toe te voegen aan een andere klasse.
subclass of: Mixin

WithLocation
type: Class
comment: A mixin to add the 'location' property to another class. @eng
comment: Een mixin om de eigenschap 'location' toe te voegen aan een andere klasse.
subclass of: Mixin

WithName
type: Class
comment: A mixin to add the 'name' property to another class. @eng
comment: Een mixin om de eigenschap 'name' toe te voegen aan een andere klasse.
subclass of: Mixin

WithSameAs
type: Class
comment: A mixin to add the 'sameAs' property to another class. @eng
comment: Een mixin om de eigenschap 'sameAs' toe te voegen aan een andere klasse.
subclass of: Mixin

WithSeeAlso
type: Class
comment: A mixin to add the 'seeAlso' property to another class. @eng
comment: Een mixin om de eigenschap 'seeAlso' toe te voegen aan een andere klasse.
subclass of: Mixin

WithTemporal
type: Class
comment: A mixin to add properties related to chronology to another class. @eng
comment: Een mixin om eigenschappen gerelateerd aan chronologie toe te voegen aan een andere klasse.
subclass of: Mixin

WithText
type: Class
comment: A mixin to add the 'text' property to another class. @eng
comment: Een mixin om de eigenschap 'text' toe te voegen aan een andere klasse.
subclass of: Mixin

addressCountry
type: Property
comment: Het land van een postadres.
comment: The country of a postal address. @eng
domain: PostalAddress
range: string

addresslocality
type: Property
comment: De plaats van een postadres.
comment: The locality in which the street address is, and which is in the region. @eng
domain: PostalAddress
range: string

addressRegion
type: Property
comment: De regio waarbinnen een postadres valt.
comment: The region in which the locality is, and which is in the country. @eng
domain: PostalAddress
range: string

after
type: Property
comment: Het subject na het object.
comment: The subject event took place after the object event. @eng
domain: WithTemporal
range: WithTemporal

age
type: Property
comment: Age at death. @eng
comment: Leeftijd bij overlijden.
domain: Person
range: Age

album
type: Property
comment: Het muziekalbum van een een muziekreferentie.
comment: The music album of a music reference. @eng
domain: MusicReference
range: Album

albumTitle
type: Property
comment: De titel van een album
comment: The title of an album @eng
domain: Album
range: langString
range: string

albumTrack
type: Property
comment: A track number on a music album, e.g. 'A1', 'B4'. @eng
comment: Het nummer van een nummer op een album, zoals 'A1' of 'B4'.
domain: MusicReference
range: string

artist
type: Property
comment: De artiest van een muziekreferentie.
comment: The artist of a music reference. @eng
domain: MusicReference
range: Artist

artistName
type: Property
comment: De naam van een artiest.
comment: The name of an artist. @eng
domain: Artist
range: string

author
type: Property
comment: De schrijver van een boek
comment: The author of a book @eng
domain: BookReference
range: author

authorName
type: Property
comment: De naam van een schrijver.
comment: The name of an author. @eng
domain: author
range: langString
range: string

before
type: Property
comment: Het subject geschiedde voor het object.
comment: The subject event took place before the object event. @eng
domain: WithTemporal
range: WithTemporal

begin
type: Property
comment: De datum waarop iets begon.
comment: The date something started. @eng
domain: WithTemporal
range: date
range: gYear
range: gYearMonth

bibleBookName
type: Property
comment: Naam van een boek uit de Bijbel.
comment: Name of a Bible book. @eng
domain: BibleBook
range: langString

bibleSource
type: Property
comment: URL of a bible quote. @eng
comment: URL van een bijbeltekst.
domain: BibleReference
range: Resource

book
type: Property
comment: A book of the bible. @eng
comment: Een boek van de bijbel.
domain: BibleReference
range: BibleBook

bookTitle
type: Property
comment: De titel van een boek.
comment: The title of a book. @eng
domain: BookReference
range: langString
range: string

chapter
type: Property
comment: A chapter in a book of the bible. @eng
comment: Een hoofdstuk in een bijbelboek.
domain: BibleReference
range: integer

commemorator
type: Property
comment: A commemorator mentioned on a tomb, a cross, or some other monument. @eng
comment: Een gedenker vermeld op een graf, een kruis, of een ander soort monument.
domain: Item
range: Person

comment
type: Property
comment: A comment @eng
comment: Een toelichting
domain: Class
range: langString
range: string

coordinates
type: Property
comment: De coördinaten van een locatie.
comment: The coordinates of a location. @eng
domain: Location
range: Coordinates

creator
type: Property
comment: A creator of a tomb, a cross, or some other monument. @eng
comment: De maker van een graf, een kruis, of een ander soort monument.
domain: Item
range: Creator

date
type: Property
comment: De eigenschap 'date'.
comment: The 'date' property. @eng
domain: WithDate
range: date
range: gYear
range: gYearMonth

dateOfBirth
type: Property
comment: Date of birth. @eng
comment: Geboortedatum.
domain: Person
range: Date

dateOfDeath
type: Property
comment: Date of death. @eng
comment: Datum van overlijden.
domain: Person
range: Date

dc Creator
type: Property
comment: Dublin Core property: An entity responsible for making the resource. @eng
comment: Eigenschap uit Dublin Core: De maker van de hulpbron.
domain: WithDcCreator
range: Resource
range: string

dc Date
type: Property
comment: Dublin Core property: A point or period of time associated with an event in the lifecycle of the resource. But we don't use it for periods of time. @eng
comment: Eigenschap uit Dublin Core, gebruikt voor het aangeven van een datum, een maand en jaar, of alleen een jaar.
domain: WithDcDate
range: dateTime

dc License
type: Property
comment: Dublin Core property: A legal document giving official permission to do something with the resource. @eng
comment: Eigenschap uit Dublin Core: Een licentie die aangeeft hoe je een hulpbron mag gebruiken.
domain: WithDcLicense
range: Resource
range: string

dc Date Modified
type: Property
comment: Dublin Core property: Date on which the resource was changed. @eng
comment: Eigenschap uit Dublin Core: Datum waarop een hulpbron is veranderd.
domain: WithDcModified
range: dateTime

dc Source
type: Property
comment: Dublin Core property: A related resource from which the described resource is derived. @eng
comment: Eigenschap uit Dublin Core: Een andere hulpbron waarvan de huidige hulpbron is afgeleid.
domain: WithDcSource
range: Resource

dc Title
type: Property
comment: Dublin Core property: A name given to the resource. @eng
comment: Eigenschap uit Dublin Core: De gegeven naam van de hulpbron.
domain: WithDcTitle
range: langString
range: string

decorationTitle
type: Property
comment: De titel van een onderscheiding, eretitel.
comment: Title of a decoration. @eng
domain: Decoration
range: langString
range: string

discogs
type: Property
comment: De URL van een album op de website van Discogs.
comment: The URL of an album entry on the Discogs website. @eng
domain: Album
range: Resource

duration
type: Property
comment: Natuurkundige grootheid die de afstand in tijd tussen twee gebeurtenissen aangeeft.
comment: Physical quantity for describing the temporal distance between events. @eng
domain: WithDuration
range: duration

end
type: Property
comment: The date something ended. @eng
comment: The datum waarop iets eindigde.
domain: WithTemporal
range: date
range: gYear
range: gYearMonth

figure
type: Property
comment: A figure on a tomb, a cross, or some other monument. @eng
comment: Een figuur op een graf, een kruis, of een ander soort monument.
domain: Item
range: Figure

file
type: Property
comment: De URL van een afbeelding.
comment: The URL of a picture file. @eng
domain: WithFile
range: Resource

fullName
type: Property
comment: De zo compleet mogelijke persoonsnaam, met voornamen en achternaam.
comment: The name of a person, as complete as possible. @eng
domain: Name
range: string

fullNameSE
type: Property
comment: A soundex-like representation of fullName. @eng
comment: Een soundex-achtige representatie van fullName.
domain: Name
range: string

geo
type: Property
comment: Geografische coördinaten.
comment: Geographical coordinates. @eng
domain: WithGeography
range: geo Point

geo latitude
type: Property
comment: De breedtegraad in graden volgens WGS84.
comment: The WGS84 latitude of a SpatialThing (decimal degrees) @eng
domain: geo Point
range: decimal

geo longitude
type: Property
comment: De lengtegraad in graden volgens WGS84.
comment: The WGS84 longitude of a SpatialThing (decimal degrees). @eng
domain: geo Point
range: decimal

hisco
type: Property
comment: A record in the HISCO database. @eng
comment: Een item in de HISCO databank.
domain: Occupation
range: Resource

hymnSource
type: Property
comment: URL of a hymn. @eng
comment: URL van een kerklied.
domain: HymnReference
range: Resource

hymnTitle
type: Property
comment: De titel van een kerklied.
comment: The title of a hymn. @eng
domain: HymnReference
range: langString
range: string

inferred
type: Property
comment: An boolean if true indicates that a value was inferred from values of other properties. @eng
comment: Een boolean die aangeeft dat een waarde was afgeleid van waardes voor andere eigenschappen.
domain: WithInferred
range: boolean

location
type: Property
comment: De locatie van iets.
comment: The location of something. @eng
domain: WithLocation
range: Location

lot
type: Property
comment: ID van de plek van een graf, bijvoorbeeld `rij G, graf 6`.
comment: lot ID of a grave, for example `row G, grave 6`. @eng
domain: Item
range: string

name
type: Property
comment: De naam van een persoon of familie.
comment: The name of a person or family. @eng
domain: WithName
range: Name

nd
type: Property
comment: Door AllegroGraph gebruikt voor geodetische berekeningen.
comment: Used by AllegroGraph for geodesic calculations. @eng
domain: WithGeography
range: lat la -9.+1 +9.+1 +1.-4 +1.-3 lon lo -1.8+2 +1.8+2 +1.-4

number
type: Property
comment: Het aantal van een heoveelheid.
comment: The number of a quantity. @eng
domain: Quantity
range: integer

occupation
type: Property
comment: Het beroep van de persoon.
comment: The person's occupation. @eng
domain: Person
range: Occupation

order
type: Property
comment: A certain numeric value used to sort Bible books in canonical order. @eng
comment: Een numerieke waarde die gebruikt wordt voor het sorteren van Bijbelboeken in canonieke volgorde.
domain: BibleBook
range: integer

organisation
type: Property
comment: An organisation, institution, school, company... where someone is/was occupied @eng
comment: Een organisatie, instelling, school, bedrijf... waar iemand werkzaam is/was
domain: Occupation
range: Organisation

organisationName
type: Property
comment: De naam van een organisatie, instelling, school, bedrijf...
comment: The name of an organisation, institution, school, company... @eng
domain: Organisation
range: langString
range: string

partOf
type: Property
comment: De locatie weer een locatie een deel van is.
comment: The location a location is part of. @eng
domain: Location
range: Location

period
type: Property
comment: A temporal property having a beginning, an end and a duration. @eng
comment: De periode of tijdsduur van iets.
domain: WithTemporal
range: Period

photo
type: Property
comment: A photo of a tomb, a cross, or some other monument. @eng
comment: Een foto van een graf, een kruis, of een ander soort monument.
domain: Item
range: Photo

pictogram
type: Property
comment: A pictogram of a symbol. @eng
comment: Een pictogram van een symbool.
domain: SymbolType
range: Pictogram

place
type: Property
comment: De plaats van een locatie.
comment: The place of a location. @eng
domain: Location
range: Place

placeName
type: Property
comment: De officiële naam van een geografische plek.
comment: The offical name of a geographic location. @eng
domain: Place
range: string

placeOfBirth
type: Property
comment: Geboorteplaats.
comment: Place of birth. @eng
domain: Person
range: Location

placeOfDeath
type: Property
comment: Plaats van overlijden.
comment: Place of death. @eng
domain: Person
range: Location

postalCode
type: Property
comment: De postcode van een adres.
comment: The postal code of an address. @eng
domain: PostalAddress
range: string

prefix
type: Property
comment: A name prefix, such as 'Mr', 'Dr'. @eng
comment: Een titel voor de naam, zoals 'Mr', 'Dr'.
domain: Name
range: string

property
type: Property
comment: A person's property. @eng
comment: Een eigenschap van een persoon.
domain: Person
range: Property

quantity
type: Property
comment: Deze 'persoon' besaat uit meerdere personen.
comment: This 'person' consists of more than one person. @eng
domain: Person
range: Quantity

quote
type: Property
comment: A quote on this tomb, cross, or other monument. @eng
comment: Een graftekst op dit graf, kruis, of ander soort monument.
domain: Item
range: Quote

quoteSubject
type: Property
comment: De persoon waaraan een graftekst gewijd.
comment: The person a quote is dedicated to. @eng
domain: Quote
range: Person

reference
type: Property
comment: De bron van een graftekst.
comment: The reference of a quote. @eng
domain: Quote
range: Reference

relation
type: Property
comment: Hoe een persoon verwant is aan een ander persoon.
comment: How one person is related to another. @eng
domain: Person
range: Relation

sameAs
type: Property
comment: URL of a reference Web page that unambiguously indicates the item's identity. @eng
comment: URL van een referentie op een webpagina die de identiteit van een item aangeeft.
domain: WithSameAs
range: Resource

seeAlso
type: Property
comment: Further information about the subject resource. @eng
comment: Verdere informatie over het onderwerp.
domain: WithSeeAlso
range: Resource

site
type: Property
comment: De plek, zoals een begraafplaats, van een graf, een kruis, of een ander soort monument.
comment: The site, such as the graveyard, of a tomb, a cross, or some other monument. @eng
domain: Item
range: Site

siteAddress
type: Property
comment: Adres, huisadres van een begraafplaats, enz.
comment: Postal Address of a cemetary, etc. @eng
domain: Site
range: PostalAddress

siteName
type: Property
comment: De naam van een begraafplaats, enz.
comment: The name of a cemetary, etc. @eng
domain: Site
range: string

streetAddress
type: Property
comment: Straat en huisnummer van een adres.
comment: The street address. @eng
domain: PostalAddress
range: string

subject
type: Property
comment: A person that is burried or remembered here. @eng
comment: Een persoon die hier ligt begraven of wordt herdacht.
domain: Item
range: Person

suffix
type: Property
comment: A name suffix, such as 'Jr'. @eng
comment: Een titel achter de naam, zoals 'Jr'.
domain: Name
range: string

symbol
type: Property
comment: A symbol on this tomb, cross, or other monument. @eng
comment: Een symbool op dit graf, kruis, of ander soort monument.
domain: Item
range: Symbol

symbolDescription
type: Property
comment: A description of a symbol. @eng
comment: Een beschrijving van een symbool.
domain: SymbolType
range: langString

symbolType
type: Property
comment: Het type van een symbool.
comment: The type of a symbol. @eng
domain: Symbol
range: SymbolType

target
type: Property
comment: De persoon tot wie de relatie is.
comment: The person who is the target of the relation. @eng
domain: Relation
range: Person

task
type: Property
comment: A task description of a TO DO. @eng
comment: De taakomschrijving van een TE DOEN.
domain: Todo
range: langString
range: string

text
type: Property
comment: De letterlijke transcriptie van (een deel van) de tekst op een monument.
comment: Literal transcription of (part of) the text found on a monument. @eng
domain: WithText
range: langString
range: string

theme
type: Property
comment: De persoon die door een figuur wordt afgebeeld.
comment: The person a figure represent. @eng
domain: Figure
range: Person

todo
type: Property
comment: A TO DO for this item. @eng
comment: Een TE DOEN voor dit item.
domain: Item
range: Todo

trackTitle
type: Property
comment: De titel van een muziekreferentie.
comment: The title of a music reference. @eng
domain: MusicReference
range: langString
range: string

verse
type: Property
comment: A verse in a chapter in a book of the bible. @eng
comment: Een vers in een hoofdstuk in een boek van de bijbel.
domain: BibleReference
range: langString
range: string